* installing *source* package ‘rasterKernelEstimates’ ... ** package ‘rasterKernelEstimates’ successfully unpacked and MD5 sums checked ** using staged installation ** libs make[1]: Entering directory '/data/gannet/ripley/R/packages/tests-clang13/rasterKernelEstimates/src' /usr/local/clang13/bin/clang -I"/data/gannet/ripley/R/R-clang-trunk/include" -DNDEBUG -isystem /usr/local/clang13/include -fopenmp -fpic -g -O3 -Wall -pedantic -c smooth.multi.c -o smooth.multi.o In file included from smooth.multi.c:9: /usr/local/clang13/lib/clang/13.0.0/include/omp.h:483:39: error: expected 'match' clause on 'omp declare variant' directive #pragma omp begin declare variant match(device={kind(host)}) ^ /data/gannet/ripley/R/R-clang-trunk/include/Rinternals.h:967:17: note: expanded from macro 'match' #define match Rf_match ^ In file included from smooth.multi.c:9: /usr/local/clang13/lib/clang/13.0.0/include/omp.h:486:39: error: expected 'match' clause on 'omp declare variant' directive #pragma omp begin declare variant match(device={kind(nohost)}) ^ /data/gannet/ripley/R/R-clang-trunk/include/Rinternals.h:967:17: note: expanded from macro 'match' #define match Rf_match ^ smooth.multi.c:64:10: warning: unused variable 'i' [-Wunused-variable] size_t i; ^ smooth.multi.c:66:10: warning: unused variable 'n' [-Wunused-variable] size_t n = right+1; ^ 2 warnings and 2 errors generated. make[1]: *** [/data/gannet/ripley/R/R-clang-trunk/etc/Makeconf:168: smooth.multi.o] Error 1 make[1]: Leaving directory '/data/gannet/ripley/R/packages/tests-clang13/rasterKernelEstimates/src' ERROR: compilation failed for package ‘rasterKernelEstimates’ * removing ‘/data/gannet/ripley/R/packages/tests-clang13/Libs/rasterKernelEstimates-lib/rasterKernelEstimates’ Command exited with non-zero status 1 Time 0:02.13, 0.54 + 0.13